Label,Description,Expression,0out_0in,0out_1in,0out_2in,0out_3in,1out_0in,1out_1in,1out_2in,1out_3in,2out_0in,2out_1in,2out_2in,2out_3in,3out_0in,3out_1in,3out_2in,3out_3in
util_middle_to_low_income_hh_,Middle to Low Income HH ,(income_in_thousands>19999) & (income_in_thousands<50000),,,,,,,,,,,,,,,,
util_mid_to_high_income_hh,Mid to High Income HH,(income_in_thousands>=50000) & (income_in_thousands<100000),,,,,,,,,,,,,,,,
util_high_income_hh,High Income HH,(income_in_thousands>=100000),,,,,,,,,,,,,,,,
util_number_of_hh_persons,Number of HH Persons,hhsize,,,,,,,,,,,,,,,,
util_number_of_full_time_workes_in_hh,Number of full time workes in HH,num_full,,,,,,,,,,,,,,,,
util_number_of_students_in_hh,Number of Students in HH,num_student,,,,,,,,,,,,,,,,
util_num_kids_between_0_and_4_including_years_old,Num Kids between 0 and 4 (including) years old,num_age_0_4,,,,,,,,,,,,,,,,
util_presence_of_kids_between_0_and_4_including_years_old,Presence of Kids between 0 and 4 (including) years old,(num_age_0_4 > 0),,,,,,,,,,,,,,,,
util_num_kids_between_4_and_15_including_years_old,Num kids between 4 and 15 (including) years old,num_age_5_15,,,,,,,,,,,,,,,,
util_presence_of_kids_between_5_and_15_including_years_old,Presence of kids between 5 and 15 (including) years old,(num_age_5_15 > 0),,,,,,,,,,,,,,,,
util_number_of_adults_16_years_old_,Number of Adults (>= 16 years old),num_adult,,,,,,,,,,,,,,,,
util_dummy_for_single_parent_household,Dummy for single parent household,(num_adult == 1) & (num_age_0_4 + num_age_5_15 > 0),,,,,,,,,,,,,,,,
util_number_of_cars_number_of_workers,Number of Cars > Number of Workers,more_cars_than_workers,,,,,,,,,,,,,,,,
util_number_of_vehicles,Number of Vehicles,auto_ownership,,coef_number_of_vehicles,coef_number_of_vehicles,coef_number_of_vehicles,coef_number_of_vehicles,coef_number_of_vehicles,coef_number_of_vehicles,coef_number_of_vehicles,coef_number_of_vehicles,coef_number_of_vehicles,coef_number_of_vehicles,coef_number_of_vehicles,coef_number_of_vehicles,coef_number_of_vehicles,coef_number_of_vehicles,coef_number_of_vehicles
util_dummy_for_female,Dummy for female,~is_joint & female,,,,,,,,,,,,,,,,
util_dummy_for_all_stops_made_by_transit,Dummy for all stops made by transit,tour_mode_is_transit,,coef_dummy_for_all_stops_made_by_transit,coef_dummy_for_all_stops_made_by_transit,coef_dummy_for_all_stops_made_by_transit,coef_dummy_for_all_stops_made_by_transit,coef_dummy_for_all_stops_made_by_transit,coef_dummy_for_all_stops_made_by_transit,coef_dummy_for_all_stops_made_by_transit,coef_dummy_for_all_stops_made_by_transit,coef_dummy_for_all_stops_made_by_transit,coef_dummy_for_all_stops_made_by_transit,coef_dummy_for_all_stops_made_by_transit,coef_dummy_for_all_stops_made_by_transit,coef_dummy_for_all_stops_made_by_transit,coef_dummy_for_all_stops_made_by_transit,coef_dummy_for_all_stops_made_by_transit
util_dummy_for_walking_to_all_stops,Dummy for walking to all stops,tour_mode_is_non_motorized,,coef_dummy_for_walking_to_all_stops,coef_dummy_for_walking_to_all_stops,coef_dummy_for_walking_to_all_stops,coef_dummy_for_walking_to_all_stops,coef_dummy_for_walking_to_all_stops,coef_dummy_for_walking_to_all_stops,coef_dummy_for_walking_to_all_stops,coef_dummy_for_walking_to_all_stops,coef_dummy_for_walking_to_all_stops,coef_dummy_for_walking_to_all_stops,coef_dummy_for_walking_to_all_stops,coef_dummy_for_walking_to_all_stops,coef_dummy_for_walking_to_all_stops,coef_dummy_for_walking_to_all_stops,coef_dummy_for_walking_to_all_stops
util_number_of_work_tours_undertaken_by_the_person,Number of work tours undertaken by the person,~is_joint * num_work_tours,,coef_number_of_work_tours_undertaken_by_the_person,coef_number_of_work_tours_undertaken_by_the_person,coef_number_of_work_tours_undertaken_by_the_person,coef_number_of_work_tours_undertaken_by_the_person,coef_number_of_work_tours_undertaken_by_the_person,coef_number_of_work_tours_undertaken_by_the_person,coef_number_of_work_tours_undertaken_by_the_person,coef_number_of_work_tours_undertaken_by_the_person,coef_number_of_work_tours_undertaken_by_the_person,coef_number_of_work_tours_undertaken_by_the_person,coef_number_of_work_tours_undertaken_by_the_person,coef_number_of_work_tours_undertaken_by_the_person,coef_number_of_work_tours_undertaken_by_the_person,coef_number_of_work_tours_undertaken_by_the_person,coef_number_of_work_tours_undertaken_by_the_person
util_number_of_university_tours_tours_undertaken_by_the_person,Number of university tours tours undertaken by the person,~is_joint * num_univ_tours,,,,,,,,,,,,,,,,
util_number_of_shool_tours_tours_undertaken_by_the_person,Number of shool tours tours undertaken by the person,~is_joint * num_school_tours,,,,,,,,,,,,,,,,
util_number_of_escort_tours_tours_undertaken_by_the_person,Number of escort tours tours undertaken by the person,~is_joint * num_escort_tours,,,,,,,,,,,,,,,,
util_number_of_shop_tours_undertaken_by_the_person,Number of shop tours undertaken by the person,~is_joint * num_shop_tours,,coef_number_of_shop_tours_undertaken_by_the_person,coef_number_of_shop_tours_undertaken_by_the_person,coef_number_of_shop_tours_undertaken_by_the_person,coef_number_of_shop_tours_undertaken_by_the_person,coef_number_of_shop_tours_undertaken_by_the_person,coef_number_of_shop_tours_undertaken_by_the_person,coef_number_of_shop_tours_undertaken_by_the_person,coef_number_of_shop_tours_undertaken_by_the_person,coef_number_of_shop_tours_undertaken_by_the_person,coef_number_of_shop_tours_undertaken_by_the_person,coef_number_of_shop_tours_undertaken_by_the_person,coef_number_of_shop_tours_undertaken_by_the_person,coef_number_of_shop_tours_undertaken_by_the_person,coef_number_of_shop_tours_undertaken_by_the_person,coef_number_of_shop_tours_undertaken_by_the_person
util_number_of_maintenace_tours_tours_undertaken_by_the_person,Number of maintenace tours tours undertaken by the person,~is_joint * num_maint_tours,,,,,,,,,,,,,,,,
util_number_of_eating_tours_tours_undertaken_by_the_person,Number of eating tours tours undertaken by the person,~is_joint * num_eatout_tours,,,,,,,,,,,,,,,,
util_number_of_visit_tours_tours_undertaken_by_the_person,Number of visit tours tours undertaken by the person,~is_joint * num_social_tours,,,,,,,,,,,,,,,,
util_number_of_shop_tours_undertaken_by_the_houshold,Number of shop tours undertaken by the houshold,num_hh_shop_tours,,,,,,,,,,,,,,,,
util_number_of_persons_participating_in_the_tour_outgoing_stops_interaction,Number of persons participating in the tour.Outgoing stops interaction,is_joint * number_of_participants,,,,,coef_number_of_persons_participating_in_the_tour_outgoing_stops_interaction,coef_number_of_persons_participating_in_the_tour_outgoing_stops_interaction,coef_number_of_persons_participating_in_the_tour_outgoing_stops_interaction,coef_number_of_persons_participating_in_the_tour_outgoing_stops_interaction,coef_number_of_persons_participating_in_the_tour_outgoing_stops_interaction,coef_number_of_persons_participating_in_the_tour_outgoing_stops_interaction,coef_number_of_persons_participating_in_the_tour_outgoing_stops_interaction,coef_number_of_persons_participating_in_the_tour_outgoing_stops_interaction,coef_number_of_persons_participating_in_the_tour_outgoing_stops_interaction,coef_number_of_persons_participating_in_the_tour_outgoing_stops_interaction,coef_number_of_persons_participating_in_the_tour_outgoing_stops_interaction,coef_number_of_persons_participating_in_the_tour_outgoing_stops_interaction
util_number_of_persons_participating_in_the_tour_return_stops_interaction,Number of persons participating in the tour.Return stops interaction,is_joint * number_of_participants,,,,,,,,,,,,,,,,
util_at_least_one_kid_and_one_adult_participate_in_the_tour,At least one kid and one adult participate in the tour,composition=='mixed',,coef_at_least_one_kid_and_one_adult_participate_in_the_tour,coef_at_least_one_kid_and_one_adult_participate_in_the_tour,coef_at_least_one_kid_and_one_adult_participate_in_the_tour,,coef_at_least_one_kid_and_one_adult_participate_in_the_tour,coef_at_least_one_kid_and_one_adult_participate_in_the_tour,coef_at_least_one_kid_and_one_adult_participate_in_the_tour,,coef_at_least_one_kid_and_one_adult_participate_in_the_tour,coef_at_least_one_kid_and_one_adult_participate_in_the_tour,coef_at_least_one_kid_and_one_adult_participate_in_the_tour,,coef_at_least_one_kid_and_one_adult_participate_in_the_tour,coef_at_least_one_kid_and_one_adult_participate_in_the_tour,coef_at_least_one_kid_and_one_adult_participate_in_the_tour
util_am_peak_departure_between_6am_and_7_am_including_interacted_with_outbound_tours,AM Peak departure between 6AM and 7 AM (including) Interacted with outbound tours,(start>5) & (start<8),,,,,,,,,,,,,,,,
util_arrival_later_than_17_00_,Arrival later than 17:00.,(end > 16),,coef_arrival_later_than_17_00_,coef_arrival_later_than_17_00_,coef_arrival_later_than_17_00_,coef_arrival_later_than_17_00_,coef_arrival_later_than_17_00_,coef_arrival_later_than_17_00_,coef_arrival_later_than_17_00_,coef_arrival_later_than_17_00_,coef_arrival_later_than_17_00_,coef_arrival_later_than_17_00_,coef_arrival_later_than_17_00_,coef_arrival_later_than_17_00_,coef_arrival_later_than_17_00_,coef_arrival_later_than_17_00_,coef_arrival_later_than_17_00_
util_evening_arrival_19_00_interacted_with_return_tours,Evening Arrival (>=19:00) Interacted with return tours,(end > 18),,,,,,,,,,,,,,,,
util_dummy_for_the_duration_of_the_tour_being_equal_or_greater_than_or_equal_to_11_hours,Dummy for the duration of the tour being equal or greater than or equal to 11 hours,(duration > 10),,,,,,,,,,,,,,,,
util_dummy_for_the_duration_of_the_tour_being_equal_or_greater_than_or_equal_to_9_hours_,Dummy for the duration of the tour being equal or greater than or equal to 9 hours ,(duration > 8),,,,,,,,,,,,,,,,
util_dummy_for_the_duration_of_the_tour_being_equal_or_greater_than_or_equal_to_3_hours_,Dummy for the duration of the tour being equal or greater than or equal to 3 hours ,(duration > 2),,coef_dummy_for_the_duration_of_the_tour_being_equal_or_greater_than_or_equal_to_3_hours_,coef_dummy_for_the_duration_of_the_tour_being_equal_or_greater_than_or_equal_to_3_hours_,coef_dummy_for_the_duration_of_the_tour_being_equal_or_greater_than_or_equal_to_3_hours_,coef_dummy_for_the_duration_of_the_tour_being_equal_or_greater_than_or_equal_to_3_hours_,coef_dummy_for_the_duration_of_the_tour_being_equal_or_greater_than_or_equal_to_3_hours_,coef_dummy_for_the_duration_of_the_tour_being_equal_or_greater_than_or_equal_to_3_hours_,coef_dummy_for_the_duration_of_the_tour_being_equal_or_greater_than_or_equal_to_3_hours_,coef_dummy_for_the_duration_of_the_tour_being_equal_or_greater_than_or_equal_to_3_hours_,coef_dummy_for_the_duration_of_the_tour_being_equal_or_greater_than_or_equal_to_3_hours_,coef_dummy_for_the_duration_of_the_tour_being_equal_or_greater_than_or_equal_to_3_hours_,coef_dummy_for_the_duration_of_the_tour_being_equal_or_greater_than_or_equal_to_3_hours_,coef_dummy_for_the_duration_of_the_tour_being_equal_or_greater_than_or_equal_to_3_hours_,coef_dummy_for_the_duration_of_the_tour_being_equal_or_greater_than_or_equal_to_3_hours_,coef_dummy_for_the_duration_of_the_tour_being_equal_or_greater_than_or_equal_to_3_hours_,coef_dummy_for_the_duration_of_the_tour_being_equal_or_greater_than_or_equal_to_3_hours_
util_hh_accesibility_for_outbound_tours_interaction,HH accesibility for outbound tours. Interaction,hhacc,,,,,,,,,,,,,,,,
util_hh_accesibility_for_inbound_tours_interaction,HH accesibility for inbound tours. Interaction,hhacc,,,,,,,,,,,,,,,,
util_primary_destination_accessibility_for_outbound_tours_interaction,Primary Destination Accessibility for outbound tours. Interaction,pracc,,,,,,,,,,,,,,,,
util_primary_destination_accessibility_for_return_tours_interaction,Primary Destination Accessibility for return tours. Interaction,pracc,,,,,,,,,,,,,,,,
util_dummy_for_distance_less_than_20_miles_,dummy for distance less than 20 Miles ,(distance_in_miles < 20),,,,,,,,,,,,,,,,
util_dummy_for_distance_in_miles,dummy for distance in miles,distance_in_miles,,coef_dummy_for_distance_in_miles,coef_dummy_for_distance_in_miles,coef_dummy_for_distance_in_miles,coef_dummy_for_distance_in_miles,coef_dummy_for_distance_in_miles,coef_dummy_for_distance_in_miles,coef_dummy_for_distance_in_miles,coef_dummy_for_distance_in_miles,coef_dummy_for_distance_in_miles,coef_dummy_for_distance_in_miles,coef_dummy_for_distance_in_miles,coef_dummy_for_distance_in_miles,coef_dummy_for_distance_in_miles,coef_dummy_for_distance_in_miles,coef_dummy_for_distance_in_miles
util_no_stops_if_tour_mode_is_drivetransit,No stops if tour mode is driveTransit,tour_mode_is_drive_transit,,coef_no_stops_if_tour_mode_is_drivetransit,coef_no_stops_if_tour_mode_is_drivetransit,coef_no_stops_if_tour_mode_is_drivetransit,coef_no_stops_if_tour_mode_is_drivetransit,coef_no_stops_if_tour_mode_is_drivetransit,coef_no_stops_if_tour_mode_is_drivetransit,coef_no_stops_if_tour_mode_is_drivetransit,coef_no_stops_if_tour_mode_is_drivetransit,coef_no_stops_if_tour_mode_is_drivetransit,coef_no_stops_if_tour_mode_is_drivetransit,coef_no_stops_if_tour_mode_is_drivetransit,coef_no_stops_if_tour_mode_is_drivetransit,coef_no_stops_if_tour_mode_is_drivetransit,coef_no_stops_if_tour_mode_is_drivetransit,coef_no_stops_if_tour_mode_is_drivetransit
util_alternative_specific_constant_for_outbound_stops,Alternative specific constant for outbound stops,~is_joint,,,,,coef_alternative_specific_constant_for_outbound_stops_1out_0in,coef_alternative_specific_constant_for_outbound_stops_1out_0in,coef_alternative_specific_constant_for_outbound_stops_1out_0in,coef_alternative_specific_constant_for_outbound_stops_1out_0in,coef_alternative_specific_constant_for_outbound_stops_2out_0in,coef_alternative_specific_constant_for_outbound_stops_2out_0in,coef_alternative_specific_constant_for_outbound_stops_2out_0in,coef_alternative_specific_constant_for_outbound_stops_2out_0in,coef_alternative_specific_constant_for_outbound_stops_3out_0in,coef_alternative_specific_constant_for_outbound_stops_3out_0in,coef_alternative_specific_constant_for_outbound_stops_3out_0in,coef_alternative_specific_constant_for_outbound_stops_3out_0in
util_alternative_specific_constant_for_return_stops,Alternative specific constant for return  stops,~is_joint,,coef_alternative_specific_constant_for_return_stops_0out_1in,coef_alternative_specific_constant_for_return_stops_0out_2in,coef_alternative_specific_constant_for_return_stops_0out_3in,,coef_alternative_specific_constant_for_return_stops_0out_1in,coef_alternative_specific_constant_for_return_stops_0out_2in,coef_alternative_specific_constant_for_return_stops_0out_3in,,coef_alternative_specific_constant_for_return_stops_0out_1in,coef_alternative_specific_constant_for_return_stops_0out_2in,coef_alternative_specific_constant_for_return_stops_0out_3in,,coef_alternative_specific_constant_for_return_stops_0out_1in,coef_alternative_specific_constant_for_return_stops_0out_2in,coef_alternative_specific_constant_for_return_stops_0out_3in
util_alternative_specific_constant_for_the_total_number_of_stops,Alternative specific constant for the total number of stops,~is_joint,,,coef_alternative_specific_constant_for_the_total_number_of_stops_0out_2in,coef_alternative_specific_constant_for_the_total_number_of_stops_0out_2in,,coef_alternative_specific_constant_for_the_total_number_of_stops_0out_2in,coef_alternative_specific_constant_for_the_total_number_of_stops_0out_2in,coef_alternative_specific_constant_for_the_total_number_of_stops_1out_3in,coef_alternative_specific_constant_for_the_total_number_of_stops_0out_2in,coef_alternative_specific_constant_for_the_total_number_of_stops_0out_2in,coef_alternative_specific_constant_for_the_total_number_of_stops_1out_3in,coef_alternative_specific_constant_for_the_total_number_of_stops_2out_3in,coef_alternative_specific_constant_for_the_total_number_of_stops_0out_2in,coef_alternative_specific_constant_for_the_total_number_of_stops_1out_3in,coef_alternative_specific_constant_for_the_total_number_of_stops_2out_3in,coef_alternative_specific_constant_for_the_total_number_of_stops_2out_3in
util_alternative_specific_constant_for_outbound_stops_on_joint_tours,Alternative specific constant for outbound stops on joint tours,is_joint,,,,,-1.783,-1.783,-1.783,-1.783,coef_alternative_specific_constant_for_outbound_stops_on_joint_tours_2out_0in,coef_alternative_specific_constant_for_outbound_stops_on_joint_tours_2out_0in,coef_alternative_specific_constant_for_outbound_stops_on_joint_tours_2out_0in,coef_alternative_specific_constant_for_outbound_stops_on_joint_tours_2out_0in,coef_alternative_specific_constant_for_outbound_stops_on_joint_tours_3out_0in,coef_alternative_specific_constant_for_outbound_stops_on_joint_tours_3out_0in,coef_alternative_specific_constant_for_outbound_stops_on_joint_tours_3out_0in,coef_alternative_specific_constant_for_outbound_stops_on_joint_tours_3out_0in
util_alternative_specific_constant_for_return_stops_on_joint_tours,Alternative specific constant for return  stops on joint tours,is_joint,,coef_alternative_specific_constant_for_return_stops_on_joint_tours_0out_1in,coef_alternative_specific_constant_for_return_stops_on_joint_tours_0out_2in,-3.379,,coef_alternative_specific_constant_for_return_stops_on_joint_tours_0out_1in,coef_alternative_specific_constant_for_return_stops_on_joint_tours_0out_2in,-3.379,,coef_alternative_specific_constant_for_return_stops_on_joint_tours_0out_1in,coef_alternative_specific_constant_for_return_stops_on_joint_tours_0out_2in,-3.379,,coef_alternative_specific_constant_for_return_stops_on_joint_tours_0out_1in,coef_alternative_specific_constant_for_return_stops_on_joint_tours_0out_2in,-3.379
util_alternative_specific_constant_for_the_total_number_of_stops_on_joint_tours,Alternative specific constant for the total number of stops on joint tours,is_joint,,,coef_alternative_specific_constant_for_the_total_number_of_stops_on_joint_tours_0out_2in,coef_alternative_specific_constant_for_the_total_number_of_stops_on_joint_tours_0out_2in,,coef_alternative_specific_constant_for_the_total_number_of_stops_on_joint_tours_0out_2in,coef_alternative_specific_constant_for_the_total_number_of_stops_on_joint_tours_0out_2in,coef_alternative_specific_constant_for_the_total_number_of_stops_on_joint_tours_1out_3in,coef_alternative_specific_constant_for_the_total_number_of_stops_on_joint_tours_0out_2in,coef_alternative_specific_constant_for_the_total_number_of_stops_on_joint_tours_0out_2in,coef_alternative_specific_constant_for_the_total_number_of_stops_on_joint_tours_1out_3in,1.497,coef_alternative_specific_constant_for_the_total_number_of_stops_on_joint_tours_0out_2in,coef_alternative_specific_constant_for_the_total_number_of_stops_on_joint_tours_1out_3in,1.497,1.497
util_dummy_for_an_outbound_visiting_tour,Dummy for an outbound visiting tour,primary_purpose == 'social',,,,,coef_dummy_for_an_outbound_visiting_tour,coef_dummy_for_an_outbound_visiting_tour,coef_dummy_for_an_outbound_visiting_tour,coef_dummy_for_an_outbound_visiting_tour,coef_dummy_for_an_outbound_visiting_tour,coef_dummy_for_an_outbound_visiting_tour,coef_dummy_for_an_outbound_visiting_tour,coef_dummy_for_an_outbound_visiting_tour,coef_dummy_for_an_outbound_visiting_tour,coef_dummy_for_an_outbound_visiting_tour,coef_dummy_for_an_outbound_visiting_tour,coef_dummy_for_an_outbound_visiting_tour
util_dummy_for_a_return_visiting_tour,Dummy for a return visiting tour,primary_purpose == 'social',,coef_dummy_for_a_return_visiting_tour,coef_dummy_for_a_return_visiting_tour,coef_dummy_for_a_return_visiting_tour,,coef_dummy_for_a_return_visiting_tour,coef_dummy_for_a_return_visiting_tour,coef_dummy_for_a_return_visiting_tour,,coef_dummy_for_a_return_visiting_tour,coef_dummy_for_a_return_visiting_tour,coef_dummy_for_a_return_visiting_tour,,coef_dummy_for_a_return_visiting_tour,coef_dummy_for_a_return_visiting_tour,coef_dummy_for_a_return_visiting_tour
util_dummy_for_a_visiting_tour_with_both_outbound_and_return_leg,Dummy for a visiting tour with both outbound and return leg,primary_purpose == 'social',,,,,,coef_dummy_for_a_visiting_tour_with_both_outbound_and_return_leg,coef_dummy_for_a_visiting_tour_with_both_outbound_and_return_leg,coef_dummy_for_a_visiting_tour_with_both_outbound_and_return_leg,,coef_dummy_for_a_visiting_tour_with_both_outbound_and_return_leg,coef_dummy_for_a_visiting_tour_with_both_outbound_and_return_leg,coef_dummy_for_a_visiting_tour_with_both_outbound_and_return_leg,,coef_dummy_for_a_visiting_tour_with_both_outbound_and_return_leg,coef_dummy_for_a_visiting_tour_with_both_outbound_and_return_leg,coef_dummy_for_a_visiting_tour_with_both_outbound_and_return_leg
